Target
Alkaline phosphatase, tissue-nonspecific isozyme
Ligand
BDBM76251
Substrate
Meas. Tech.
Dose Response confirmation of uHTS inhibitors of Mouse Intestinal Alkaline Phosphatase using Tissue Nonspecific Alkaline Phosphatase.
IC50
15600±n/a nM
Citation
 PubChem, PC Dose Response confirmation of uHTS inhibitors of Mouse Intestinal Alkaline Phosphatase using Tissue Nonspecific Alkaline Phosphatase. PubChem Bioassay (2010)[AID] 
Target
Name:
Alkaline phosphatase, tissue-nonspecific isozyme
Synonyms:
ALPL tissue-nonspecific alkaline phosphatase precursor
Type:
PROTEIN
Mol. Mass.:
57306.17
Organism:
Homo sapiens (Human)
Description:
ChEMBL_1448917
Residue:
524
  
Inhibitor
Name:
BDBM76251
Synonyms:
1-(4-phenylbutyl)-3-[[(2S,5S)-5-[(4-phenylphenyl)methyl]-2-oxolanyl]methyl]urea 1-[[(2S,5S)-5-(4-phenylbenzyl)tetrahydrofuran-2-yl]methyl]-3-(4-phenylbutyl)urea SMR001522428 | cid_42627831
Type:
Small organic molecule
Emp. Form.:
C29H34N2O2
Mol. Mass.:
442.5925
SMILES:
O=C(NCCCCc1ccccc1)NC[C@@H]1CC[C@@H](Cc2ccc(cc2)-c2ccccc2)O1
: