Target
Sentrin-specific protease 8
Ligand
BDBM76584
Substrate
Meas. Tech.
Dose Response confirmation of inhibitors of Sentrin-specific proteases (SENPs) using a Luminescent Interference Counterscreen assay
IC50
782±31 nM
Citation
 PubChem, PC Dose Response confirmation of inhibitors of Sentrin-specific proteases (SENPs) using a Luminescent Interference Counterscreen assay PubChem Bioassay (2010)[AID] 
Target
Name:
Sentrin-specific protease 8
Synonyms:
DEN1 PRSC2 SENP8_HUMAN | SUMO/sentrin specific peptidase family member 8
Type:
Enzyme Catalytic Domain
Mol. Mass.:
24104.52
Organism:
Homo sapiens (Human)
Description:
gi_262118306
Residue:
212
  
Inhibitor
Name:
BDBM76584
Synonyms:
2-(4-ethoxybenzylidene)tetralin-1-one MLS000756586 cid_318105
Type:
Small organic molecule
Emp. Form.:
C19H18O2
Mol. Mass.:
278.345
SMILES:
CCOc1ccc(C=C2CCc3ccccc3C2=O)cc1
: