Target
Sentrin-specific protease 8
Ligand
BDBM76586
Substrate
Meas. Tech.
Dose Response confirmation of inhibitors of Sentrin-specific proteases (SENPs) using a Luminescent Interference Counterscreen assay
IC50
884±36 nM
Citation
 PubChem, PC Dose Response confirmation of inhibitors of Sentrin-specific proteases (SENPs) using a Luminescent Interference Counterscreen assay PubChem Bioassay (2010)[AID] 
Target
Name:
Sentrin-specific protease 8
Synonyms:
DEN1 PRSC2 SENP8_HUMAN | SUMO/sentrin specific peptidase family member 8
Type:
Enzyme Catalytic Domain
Mol. Mass.:
24104.52
Organism:
Homo sapiens (Human)
Description:
gi_262118306
Residue:
212
  
Inhibitor
Name:
BDBM76586
Synonyms:
2-(4-nitrobenzylidene)tetralin-1-one MLS000756777 cid_315039
Type:
Small organic molecule
Emp. Form.:
C17H13NO3
Mol. Mass.:
279.29
SMILES:
[O-][N+](=O)c1ccc(\C=C2/CCc3ccccc3C2=O)cc1
: