Target
Sentrin-specific protease 6
Ligand
BDBM41826
Substrate
Meas. Tech.
Dose Response confirmation of uHTS for inhibitors of Sentrin-specific protease 6 (SENP6) using a Luminescent assay
IC50
1860±n/a nM
Citation
 PubChem, PC Dose Response confirmation of uHTS for inhibitors of Sentrin-specific protease 6 (SENP6) using a Luminescent assay PubChem Bioassay (2010)[AID] 
Target
Name:
Sentrin-specific protease 6
Synonyms:
KIAA0797 SENP6_HUMAN SUMO-1-specific protease Sentrin-specific protease 6 (SENP6)
Type:
Enzyme Catalytic Domain
Mol. Mass.:
126147.68
Organism:
Homo sapiens (Human)
Description:
Q9GZR1
Residue:
1112
  
Inhibitor
Name:
BDBM41826
Synonyms:
2-[[(4E)-1-keto-4-(2-thienylsulfonylimino)-2-naphthyl]amino]benzoic acid methyl ester MLS000521465 cid_9550941 methyl 2-[[(4E)-1-oxo-4-thiophen-2-ylsulfonyliminonaphthalen-2-yl]amino]benzoate
Type:
Small organic molecule
Emp. Form.:
C22H16N2O5S2
Mol. Mass.:
452.503
SMILES:
COC(=O)c1ccccc1NC1=CC(=NS(=O)(=O)c2cccs2)c2ccccc2C1=O
: