Target
Sentrin-specific protease 6
Ligand
BDBM76437
Substrate
Meas. Tech.
Dose Response confirmation of uHTS for inhibitors of Sentrin-specific protease 6 (SENP6) using a Luminescent assay
IC50
2340±n/a nM
Citation
 PubChem, PC Dose Response confirmation of uHTS for inhibitors of Sentrin-specific protease 6 (SENP6) using a Luminescent assay PubChem Bioassay (2010)[AID] 
Target
Name:
Sentrin-specific protease 6
Synonyms:
KIAA0797 SENP6_HUMAN SUMO-1-specific protease Sentrin-specific protease 6 (SENP6)
Type:
Enzyme Catalytic Domain
Mol. Mass.:
126147.68
Organism:
Homo sapiens (Human)
Description:
Q9GZR1
Residue:
1112
  
Inhibitor
Name:
BDBM76437
Synonyms:
(3,4-dihydro-2H-naphthalen-1-ylideneamino) 4-fluoranylbenzoate 1-{[(4-fluorobenzoyl)oxy]imino}-1,2,3,4-tetrahydronaphthalene 4-fluorobenzoic acid (tetralin-1-ylideneamino) ester SMR000180050 | cid_1489353
Type:
Small organic molecule
Emp. Form.:
C17H14FNO2
Mol. Mass.:
283.297
SMILES:
Fc1ccc(cc1)C(=O)ON=C1CCCc2ccccc12
: