Target
Sentrin-specific protease 6
Ligand
BDBM76488
Substrate
Meas. Tech.
Dose Response confirmation of uHTS for inhibitors of Sentrin-specific protease 6 (SENP6) using a Luminescent assay
IC50
1310±n/a nM
Citation
 PubChem, PC Dose Response confirmation of uHTS for inhibitors of Sentrin-specific protease 6 (SENP6) using a Luminescent assay PubChem Bioassay (2010)[AID] 
Target
Name:
Sentrin-specific protease 6
Synonyms:
KIAA0797 SENP6_HUMAN SUMO-1-specific protease Sentrin-specific protease 6 (SENP6)
Type:
Enzyme Catalytic Domain
Mol. Mass.:
126147.68
Organism:
Homo sapiens (Human)
Description:
Q9GZR1
Residue:
1112
  
Inhibitor
Name:
BDBM76488
Synonyms:
(1-pyridin-2-ylethylideneamino) 4-bromanylbenzoate 1-(2-pyridinyl)ethanone O-(4-bromobenzoyl)oxime 4-bromobenzoic acid [1-(2-pyridyl)ethylideneamino] ester SMR000269364 | cid_770951
Type:
Small organic molecule
Emp. Form.:
C14H11BrN2O2
Mol. Mass.:
319.153
SMILES:
CC(=NOC(=O)c1ccc(Br)cc1)c1ccccn1
: