Target
Tyrosine-protein phosphatase non-receptor type 7
Ligand
BDBM55601
Substrate
Meas. Tech.
Dose Response confirmation of compounds that inhibit HePTP
IC50
556±n/a nM
Citation
 PubChem, PC Dose Response confirmation of compounds that inhibit HePTP PubChem Bioassay (2010)[AID] 
Target
Name:
Tyrosine-protein phosphatase non-receptor type 7
Synonyms:
He-PTP Hematopoietic protein-tyrosine phosphatase (HEPTP) PTPN7 Tyrosine-protein phosphatase non-receptor type 7 | Tyrosine-protein phosphatase non-receptor type 7 (HEPTP)
Type:
Protein
Mol. Mass.:
40530.79
Organism:
Homo sapiens (Human)
Description:
P35236
Residue:
360
  
Inhibitor
Name:
BDBM55601
Synonyms:
1-(2,3-dihydroindol-1-yl)-2-[[(5E)-4-(4-ethoxyphenyl)-5-(3-indolylidene)-1H-1,2,4-triazol-3-yl]thio]ethanone 1-indolin-1-yl-2-[[(5E)-5-indol-3-ylidene-4-p-phenetyl-1H-1,2,4-triazol-3-yl]thio]ethanone SMR000237500 | cid_6161440
Type:
Small organic molecule
Emp. Form.:
C28H25N5O2S
Mol. Mass.:
495.595
SMILES:
CCOc1ccc(cc1)-n1c(SCC(=O)N2CCc3ccccc23)nnc1-c1c[nH]c2ccccc12
: