Target
Kappa-type opioid receptor
Ligand
BDBM75578
Substrate
Meas. Tech.
SAR analysis of Antagonists of the Kappa Opioid Receptor (KOR) using an Image-Based Assay - Set 4
IC50
>32000±n/a nM
Citation
 PubChem, PC SAR analysis of Antagonists of the Kappa Opioid Receptor (KOR) using an Image-Based Assay - Set 4 PubChem Bioassay (2010)[AID] 
Target
Name:
Kappa-type opioid receptor
Synonyms:
K-OR-1 Kappa-opioid receptor (KOR) Kappa-type opioid receptor (KOR) OPIATE Kappa OPRK1 kappa opioid receptor (KOR)
Type:
G Protein-Coupled Receptor (GPCR)
Mol. Mass.:
42648.76
Organism:
Homo sapiens (Human)
Description:
P41145
Residue:
380
  
Inhibitor
Name:
BDBM75578
Synonyms:
4-[[(4-methylphenyl)sulfonylamino]methyl]-N-[1-(phenylmethyl)-3-pyrrolidinyl]benzamide KSC-11-146-1 N-(1-benzylpyrrolidin-3-yl)-4-[(tosylamino)methyl]benzamide cid_45479170
Type:
Small organic molecule
Emp. Form.:
C26H29N3O3S
Mol. Mass.:
463.592
SMILES:
Cc1ccc(cc1)S(=O)(=O)NCc1ccc(cc1)C(=O)NC1CCN(Cc2ccccc2)C1
: