Target
Kappa-type opioid receptor
Ligand
BDBM71614
Substrate
Meas. Tech.
SAR analysis of small molecule antagonists of the kappa opioid receptor via a luminescent beta-arrestin assay - Set 6
IC50
>20000±n/a nM
Citation
 PubChem, PC SAR analysis of small molecule antagonists of the kappa opioid receptor via a luminescent beta-arrestin assay - Set 6 PubChem Bioassay (2010)[AID] 
Target
Name:
Kappa-type opioid receptor
Synonyms:
K-OR-1 Kappa-opioid receptor (KOR) Kappa-type opioid receptor (KOR) OPIATE Kappa OPRK1 kappa opioid receptor (KOR)
Type:
G Protein-Coupled Receptor (GPCR)
Mol. Mass.:
42648.76
Organism:
Homo sapiens (Human)
Description:
P41145
Residue:
380
  
Inhibitor
Name:
BDBM71614
Synonyms:
KSC-1-267 cid_44828477
Type:
Small organic molecule
Emp. Form.:
C25H28N6O2
Mol. Mass.:
444.5288
SMILES:
O=C(Cn1c2ncccc2n2cccc2c1=O)NCCCN1CCN(CC1)c1ccccc1
: