Target
G-protein coupled receptor 35
Ligand
BDBM61631
Substrate
Meas. Tech.
SAR Analysis for the identification of Selective Antagonists of ERK1/2 Activity in GPR35-Overexpressing U2OS Cells - Set 2
IC50
2290±85.34 nM
Citation
 PubChem, PC SAR Analysis for the identification of Selective Antagonists of ERK1/2 Activity in GPR35-Overexpressing U2OS Cells - Set 2 PubChem Bioassay (2010)[AID] 
Target
Name:
G-protein coupled receptor 35
Synonyms:
G protein-coupled receptor 35 GPR35_HUMAN
Type:
Enzyme Catalytic Domain
Mol. Mass.:
34085.57
Organism:
Homo sapiens (Human)
Description:
gi_33695097
Residue:
309
  
Inhibitor
Name:
BDBM61631
Synonyms:
1-(2,4-difluorophenyl)-5-[(E)-(methylthiocarbamoylhydrazono)methyl]pyrazole-4-carboxylic acid methyl ester 1-(2,4-difluorophenyl)-5-[[[methylamino(sulfanylidene)methyl]hydrazinylidene]methyl]-4-pyrazolecarboxylic acid methyl ester SMR000461567 methyl 1-(2,4-difluorophenyl)-5-[(methylcarbamothioylhydrazinylidene)methyl]pyrazole-4-carboxylate methyl 1-[2,4-bis(fluoranyl)phenyl]-5-[(methylcarbamothioylhydrazinylidene)methyl]pyrazole-4-carboxylate
Type:
Small organic molecule
Emp. Form.:
C14H13F2N5O2S
Mol. Mass.:
353.347
SMILES:
CNC(=S)NN=Cc1c(cnn1-c1ccc(F)cc1F)C(=O)OC
: