Target
G-protein coupled receptor 35
Ligand
BDBM75867
Substrate
Meas. Tech.
SAR Analysis for the identification of Selective Antagonists of ERK1/2 Activity in GPR35-Overexpressing U2OS Cells - Set 2
IC50
4110±110.9 nM
Citation
 PubChem, PC SAR Analysis for the identification of Selective Antagonists of ERK1/2 Activity in GPR35-Overexpressing U2OS Cells - Set 2 PubChem Bioassay (2010)[AID] 
Target
Name:
G-protein coupled receptor 35
Synonyms:
G protein-coupled receptor 35 GPR35_HUMAN
Type:
Enzyme Catalytic Domain
Mol. Mass.:
34085.57
Organism:
Homo sapiens (Human)
Description:
gi_33695097
Residue:
309
  
Inhibitor
Name:
BDBM75867
Synonyms:
1-(4-chlorophenyl)-5-[(E)-(methylthiocarbamoylhydrazono)methyl]pyrazole-4-carboxylic acid methyl ester MLS-0437445.0001 methyl 1-(4-chlorophenyl)-5-[(E)-(methylcarbamothioylhydrazinylidene)methyl]pyrazole-4-carboxylate
Type:
Small organic molecule
Emp. Form.:
C14H14ClN5O2S
Mol. Mass.:
351.811
SMILES:
CNC(=S)NN=Cc1c(cnn1-c1ccc(Cl)cc1)C(=O)OC
: