Target
Voltage-dependent T-type calcium channel subunit alpha-1H
Ligand
BDBM50017702
Substrate
Meas. Tech.
Inhibitors of T-Type Calcium Channel
EC50
5620±0 nM
Citation
 PubChem, PC Inhibitors of T-Type Calcium Channel PubChem Bioassay (2010)[AID] 
Target
Name:
Voltage-dependent T-type calcium channel subunit alpha-1H
Synonyms:
CAC1H_HUMAN Low-voltage-activated calcium channel alpha1 3.2 subunit Voltage-gated calcium channel voltage-dependent T-type calcium channel subunit alpha-1H isoform a
Type:
Enzyme Catalytic Domain
Mol. Mass.:
259187.68
Organism:
Homo sapiens (Human)
Description:
Calcium channel (Type T,L) 0 0::O95180
Residue:
2353
  
Inhibitor
Name:
BDBM50017702
Synonyms:
1-(bis(4-fluorophenyl)methyl)-4-cinnamylpiperazine 1-[Bis-(4-fluoro-phenyl)-methyl]-4-(3-phenyl-allyl)-piperazine CHEMBL30008 Flunarizine cid_6365505
Type:
Small organic molecule
Emp. Form.:
C26H26F2N2
Mol. Mass.:
404.4948
SMILES:
Fc1ccc(cc1)C(N1CCN(C\C=C\c2ccccc2)CC1)c1ccc(F)cc1
: