Target
Voltage-dependent T-type calcium channel subunit alpha-1H
Ligand
BDBM76889
Substrate
Meas. Tech.
Inhibitors of T-Type Calcium Channel
EC50
3550±0 nM
Citation
 PubChem, PC Inhibitors of T-Type Calcium Channel PubChem Bioassay (2010)[AID] 
Target
Name:
Voltage-dependent T-type calcium channel subunit alpha-1H
Synonyms:
CAC1H_HUMAN Low-voltage-activated calcium channel alpha1 3.2 subunit Voltage-gated calcium channel voltage-dependent T-type calcium channel subunit alpha-1H isoform a
Type:
Enzyme Catalytic Domain
Mol. Mass.:
259187.68
Organism:
Homo sapiens (Human)
Description:
Calcium channel (Type T,L) 0 0::O95180
Residue:
2353
  
Inhibitor
Name:
BDBM76889
Synonyms:
2-(1H-benzimidazol-2-ylmethylsulfanyl)-1-[4-(3-chlorophenyl)piperazin-1-yl]ethanone 2-(1H-benzimidazol-2-ylmethylthio)-1-[4-(3-chlorophenyl)piperazino]ethanone SMR000064217 | cid_2090188
Type:
Small organic molecule
Emp. Form.:
C20H21ClN4OS
Mol. Mass.:
400.925
SMILES:
Clc1cccc(c1)N1CCN(CC1)C(=O)CSCc1nc2ccccc2[nH]1
: