Target
Voltage-dependent T-type calcium channel subunit alpha-1H
Ligand
BDBM45418
Substrate
Meas. Tech.
Inhibitors of T-Type Calcium Channel
EC50
2210±0 nM
Citation
 PubChem, PC Inhibitors of T-Type Calcium Channel PubChem Bioassay (2010)[AID] 
Target
Name:
Voltage-dependent T-type calcium channel subunit alpha-1H
Synonyms:
CAC1H_HUMAN Low-voltage-activated calcium channel alpha1 3.2 subunit Voltage-gated calcium channel voltage-dependent T-type calcium channel subunit alpha-1H isoform a
Type:
Enzyme Catalytic Domain
Mol. Mass.:
259187.68
Organism:
Homo sapiens (Human)
Description:
Calcium channel (Type T,L) 0 0::O95180
Residue:
2353
  
Inhibitor
Name:
BDBM45418
Synonyms:
1-(3,4-dihydro-1H-isoquinolin-2-yl)-2-[[5-methyl-2-(4-methylphenyl)-1,3-oxazol-4-yl]methylsulfonyl]ethanone 1-(3,4-dihydro-1H-isoquinolin-2-yl)-2-[[5-methyl-2-(p-tolyl)oxazol-4-yl]methylsulfonyl]ethanone SMR000094650 | cid_5309336
Type:
Small organic molecule
Emp. Form.:
C23H24N2O4S
Mol. Mass.:
424.513
SMILES:
Cc1oc(nc1CS(=O)(=O)CC(=O)N1CCc2ccccc2C1)-c1ccc(C)cc1
: