Target
Protein RecA
Ligand
BDBM40314
Substrate
Meas. Tech.
Intein inhibitors as potential Tuberculosis drugs
IC50
6350±n/a nM
Citation
 PubChem, PC Intein inhibitors as potential Tuberculosis drugs PubChem Bioassay (2010)[AID] 
Target
Name:
Protein RecA
Synonyms:
DNA recombination protein RecA recA
Type:
Enzyme Catalytic Domain
Mol. Mass.:
85386.52
Organism:
Mycobacterium tuberculosis H37Rv
Description:
gi_15609874
Residue:
790
  
Inhibitor
Name:
BDBM40314
Synonyms:
3-(4-Chloro-phenyl)-1,6-dimethyl-1H-pyrimido[5,4-e][1,2,4]triazine-5,7-dione 3-(4-chlorophenyl)-1,6-dimethyl-pyrimido[5,4-e][1,2,4]triazine-5,7-quinone MLS000523518 US9073941, 603 | cid_460749
Type:
Small organic molecule
Emp. Form.:
C13H10ClN5O2
Mol. Mass.:
303.704
SMILES:
Cn1nc(nc2c1nc(=O)n(C)c2=O)-c1ccc(Cl)cc1
: