Target
Protein RecA
Ligand
BDBM65076
Substrate
Meas. Tech.
Intein inhibitors as potential Tuberculosis drugs
IC50
44940±n/a nM
Citation
 PubChem, PC Intein inhibitors as potential Tuberculosis drugs PubChem Bioassay (2010)[AID] 
Target
Name:
Protein RecA
Synonyms:
DNA recombination protein RecA recA
Type:
Enzyme Catalytic Domain
Mol. Mass.:
85386.52
Organism:
Mycobacterium tuberculosis H37Rv
Description:
gi_15609874
Residue:
790
  
Inhibitor
Name:
BDBM65076
Synonyms:
(4,5-dichloro-6-oxopyridazin-1-yl)methyl 3-(trifluoromethyl)benzoate 3-(trifluoromethyl)benzoic acid (4,5-dichloro-6-oxo-1-pyridazinyl)methyl ester SMR000180162 [4,5-dichloro-6-oxo-1(6H)-pyridazinyl]methyl 3-(trifluoromethyl)benzenecarboxylate | cid_1474463
Type:
Small organic molecule
Emp. Form.:
C13H7Cl2F3N2O3
Mol. Mass.:
367.107
SMILES:
FC(F)(F)c1cccc(c1)C(=O)OCn1ncc(Cl)c(Cl)c1=O
: