Target
Protein RecA
Ligand
BDBM61119
Substrate
Meas. Tech.
Intein inhibitors as potential Tuberculosis drugs
IC50
1390±n/a nM
Citation
 PubChem, PC Intein inhibitors as potential Tuberculosis drugs PubChem Bioassay (2010)[AID] 
Target
Name:
Protein RecA
Synonyms:
DNA recombination protein RecA recA
Type:
Enzyme Catalytic Domain
Mol. Mass.:
85386.52
Organism:
Mycobacterium tuberculosis H37Rv
Description:
gi_15609874
Residue:
790
  
Inhibitor
Name:
BDBM61119
Synonyms:
2-Chloro-1-(8-methyl-1,2,3a,4,5,6-hexahydro-pyrazino[3,2,1-jk]carbazol-3-yl)-ethanone SMR000516551 | cid_3129074
Type:
Small organic molecule
Emp. Form.:
C17H19ClN2O
Mol. Mass.:
302.799
SMILES:
Cc1ccc2n3CCN(C4CCCc(c34)c2c1)C(=O)CCl
: