Target
Caspase-7
Ligand
BDBM77497
Substrate
Meas. Tech.
Counterscreen for procaspase-3 activators: absorbance-based biochemical high throughput dose response assay for activators of procaspase-7
EC50
>85222±n/a nM
Citation
 PubChem, PC Counterscreen for procaspase-3 activators: absorbance-based biochemical high throughput dose response assay for activators of procaspase-7 PubChem Bioassay (2010)[AID] 
Target
Name:
Caspase-7
Synonyms:
Apoptotic protease Mch-3 CASP7 CMH-1 MCH3 | caspase 7, apoptosis-related cysteine peptidase
Type:
Enzyme
Mol. Mass.:
34273.91
Organism:
Homo sapiens (Human)
Description:
P55210
Residue:
303
  
Inhibitor
Name:
BDBM77497
Synonyms:
MLS000522781 N-[2-[1-[(4-methylphenyl)methyl]-2-benzimidazolyl]ethyl]acetamide N-[2-[1-[(4-methylphenyl)methyl]benzimidazol-2-yl]ethyl]ethanamide cid_3160764
Type:
Small organic molecule
Emp. Form.:
C19H21N3O
Mol. Mass.:
307.3895
SMILES:
CC(=O)NCCc1nc2ccccc2n1Cc1ccc(C)cc1
: