Target
Caspase-3
Ligand
BDBM50445
Substrate
Meas. Tech.
Absorbance-based biochemical high throughput dose response assay for activators of procaspase-3
EC50
>85267±n/a nM
Citation
 PubChem, PC Absorbance-based biochemical high throughput dose response assay for activators of procaspase-3 PubChem Bioassay (2010)[AID] 
Target
Name:
Caspase-3
Synonyms:
Apopain CASP3 CPP-32 Caspase 3 Caspase-3 subunit p17 SCA-1 Yama protein | caspase-3 preproprotein
Type:
Hydrolase; heterotetramer of two heterodimers
Mol. Mass.:
31607.55
Organism:
Homo sapiens (Human)
Description:
Residue:
277
  
Inhibitor
Name:
BDBM50445
Synonyms:
4-[(2-oxidanylidenebenzo[cd]indol-1-yl)methyl]-N'-[(E)-(2-oxidanyl-4-oxidanylidene-cyclohexa-2,5-dien-1-ylidene)methyl]benzohydrazide N'-[(E)-(2-hydroxy-4-keto-cyclohexa-2,5-dien-1-ylidene)methyl]-4-[(2-ketobenzo[cd]indol-1-yl)methyl]benzohydrazide N'-[(E)-(2-hydroxy-4-oxocyclohexa-2,5-dien-1-ylidene)methyl]-4-[(2-oxobenzo[cd]indol-1-yl)methyl]benzohydrazide cid_6508318
Type:
Small organic molecule
Emp. Form.:
C26H19N3O4
Mol. Mass.:
437.4468
SMILES:
Oc1ccc(C=NNC(=O)c2ccc(CN3C(=O)c4cccc5cccc3c45)cc2)c(O)c1
: