Target
Mitochondrial import inner membrane translocase subunit TIM10
Ligand
BDBM78075
Substrate
Meas. Tech.
Dose Response confirmation of uHTS small molecule inhibitors of tim10-1 yeast via a luminescent assay
IC50
9220±n/a nM
Citation
 PubChem, PC Dose Response confirmation of uHTS small molecule inhibitors of tim10-1 yeast via a luminescent assay PubChem Bioassay (2010)[AID] 
Target
Name:
Mitochondrial import inner membrane translocase subunit TIM10
Synonyms:
MRS11 TIM10_YEAST TPA: Essential protein of the mitochondrial intermembrane space, forms a complex with Tim9p (TIM10 complex) that delivers hydrophobic proteins to the TIM22 complex for insertion into the inner ...
Type:
Enzyme Catalytic Domain
Mol. Mass.:
10303.50
Organism:
Saccharomyces cerevisiae S288c
Description:
gi_285809906
Residue:
93
  
Inhibitor
Name:
BDBM78075
Synonyms:
2-(4-methylphenoxy)acetic acid [(Z)-[1-amino-2-(4-chlorophenyl)ethylidene]amino] ester SMR000147529 [(Z)-[1-azanyl-2-(4-chlorophenyl)ethylidene]amino] 2-(4-methylphenoxy)ethanoate | cid_5919570
Type:
Small organic molecule
Emp. Form.:
C17H17ClN2O3
Mol. Mass.:
332.781
SMILES:
Cc1ccc(OCC(=O)ONC(=N)Cc2ccc(Cl)cc2)cc1
: