Target
Mitochondrial import inner membrane translocase subunit TIM10
Ligand
BDBM63271
Substrate
Meas. Tech.
Dose Response confirmation of uHTS small molecule inhibitors of tim10-1 yeast via a luminescent assay
IC50
8340±n/a nM
Citation
 PubChem, PC Dose Response confirmation of uHTS small molecule inhibitors of tim10-1 yeast via a luminescent assay PubChem Bioassay (2010)[AID] 
Target
Name:
Mitochondrial import inner membrane translocase subunit TIM10
Synonyms:
MRS11 TIM10_YEAST TPA: Essential protein of the mitochondrial intermembrane space, forms a complex with Tim9p (TIM10 complex) that delivers hydrophobic proteins to the TIM22 complex for insertion into the inner ...
Type:
Enzyme Catalytic Domain
Mol. Mass.:
10303.50
Organism:
Saccharomyces cerevisiae S288c
Description:
gi_285809906
Residue:
93
  
Inhibitor
Name:
BDBM63271
Synonyms:
5-(4-chloranyl-2-nitro-phenyl)sulfanyl-N-propan-2-yl-1,3,4-thiadiazol-2-amine 5-[(4-chloro-2-nitrophenyl)thio]-N-propan-2-yl-1,3,4-thiadiazol-2-amine SMR000264488 cid_2535936
Type:
Small organic molecule
Emp. Form.:
C11H11ClN4O2S2
Mol. Mass.:
330.814
SMILES:
CC(C)Nc1nnc(Sc2ccc(Cl)cc2[N+]([O-])=O)s1
: