Target
Voltage-dependent T-type calcium channel subunit alpha-1H
Ligand
BDBM62892
Substrate
Meas. Tech.
Inhibitors of T-Type Calcium Channels
EC50
1810±n/a nM
Citation
 PubChem, PC Inhibitors of T-Type Calcium Channels PubChem Bioassay (2011)[AID] 
Target
Name:
Voltage-dependent T-type calcium channel subunit alpha-1H
Synonyms:
CAC1H_HUMAN Low-voltage-activated calcium channel alpha1 3.2 subunit Voltage-gated calcium channel voltage-dependent T-type calcium channel subunit alpha-1H isoform a
Type:
Enzyme Catalytic Domain
Mol. Mass.:
259187.68
Organism:
Homo sapiens (Human)
Description:
Calcium channel (Type T,L) 0 0::O95180
Residue:
2353
  
Inhibitor
Name:
BDBM62892
Synonyms:
2-[7-Oxo-7-(3-phenyl-pyrrolidin-1-yl)-heptyl]-isoindole-1,3-dione 2-[7-oxidanylidene-7-(3-phenylpyrrolidin-1-yl)heptyl]isoindole-1,3-dione 2-[7-oxo-7-(3-phenylpyrrolidin-1-yl)heptyl]isoindole-1,3-dione SMR000118340 | cid_3148600
Type:
Small organic molecule
Emp. Form.:
C25H28N2O3
Mol. Mass.:
404.5014
SMILES:
O=C(CCCCCCN1C(=O)c2ccccc2C1=O)N1CCC(C1)c1ccccc1
: