Target
Voltage-dependent T-type calcium channel subunit alpha-1H
Ligand
BDBM78458
Substrate
Meas. Tech.
Inhibitors of T-Type Calcium Channels (SynthLib1)
EC50
2100±n/a nM
Citation
 PubChem, PC Inhibitors of T-Type Calcium Channels (SynthLib1) PubChem Bioassay (2011)[AID] 
Target
Name:
Voltage-dependent T-type calcium channel subunit alpha-1H
Synonyms:
CAC1H_HUMAN Low-voltage-activated calcium channel alpha1 3.2 subunit Voltage-gated calcium channel voltage-dependent T-type calcium channel subunit alpha-1H isoform a
Type:
Enzyme Catalytic Domain
Mol. Mass.:
259187.68
Organism:
Homo sapiens (Human)
Description:
Calcium channel (Type T,L) 0 0::O95180
Residue:
2353
  
Inhibitor
Name:
BDBM78458
Synonyms:
N-[5-(1,3-benzodioxol-5-yl)-1,3,4-oxadiazol-2-yl]-2-(2-chloranyl-4-fluoranyl-phenoxy)ethanamide N-[5-(1,3-benzodioxol-5-yl)-1,3,4-oxadiazol-2-yl]-2-(2-chloro-4-fluorophenoxy)acetamide cid_44251491
Type:
Small organic molecule
Emp. Form.:
C17H11ClFN3O5
Mol. Mass.:
391.738
SMILES:
Fc1ccc(OCC(=O)Nc2nnc(o2)-c2ccc3OCOc3c2)c(Cl)c1
: