Target
Voltage-dependent T-type calcium channel subunit alpha-1H
Ligand
BDBM78484
Substrate
Meas. Tech.
Inhibitors of T-Type Calcium Channels (SynthLib1)
EC50
1700±n/a nM
Citation
 PubChem, PC Inhibitors of T-Type Calcium Channels (SynthLib1) PubChem Bioassay (2011)[AID] 
Target
Name:
Voltage-dependent T-type calcium channel subunit alpha-1H
Synonyms:
CAC1H_HUMAN Low-voltage-activated calcium channel alpha1 3.2 subunit Voltage-gated calcium channel voltage-dependent T-type calcium channel subunit alpha-1H isoform a
Type:
Enzyme Catalytic Domain
Mol. Mass.:
259187.68
Organism:
Homo sapiens (Human)
Description:
Calcium channel (Type T,L) 0 0::O95180
Residue:
2353
  
Inhibitor
Name:
BDBM78484
Synonyms:
2-(3-chloranyl-4-fluoranyl-phenoxy)-N-[5-(4-fluorophenyl)-1,3,4-oxadiazol-2-yl]ethanamide 2-(3-chloro-4-fluorophenoxy)-N-[5-(4-fluorophenyl)-1,3,4-oxadiazol-2-yl]acetamide cid_44263509
Type:
Small organic molecule
Emp. Form.:
C16H10ClF2N3O3
Mol. Mass.:
365.719
SMILES:
Fc1ccc(cc1)-c1nnc(NC(=O)COc2ccc(F)c(Cl)c2)o1
: