Target
Voltage-dependent T-type calcium channel subunit alpha-1H
Ligand
BDBM78501
Substrate
Meas. Tech.
Inhibitors of T-Type Calcium Channels (SynthLib2)
EC50
10000±n/a nM
Citation
 PubChem, PC Inhibitors of T-Type Calcium Channels (SynthLib2) PubChem Bioassay (2011)[AID] 
Target
Name:
Voltage-dependent T-type calcium channel subunit alpha-1H
Synonyms:
CAC1H_HUMAN Low-voltage-activated calcium channel alpha1 3.2 subunit Voltage-gated calcium channel voltage-dependent T-type calcium channel subunit alpha-1H isoform a
Type:
Enzyme Catalytic Domain
Mol. Mass.:
259187.68
Organism:
Homo sapiens (Human)
Description:
Calcium channel (Type T,L) 0 0::O95180
Residue:
2353
  
Inhibitor
Name:
BDBM78501
Synonyms:
2,4-bis(chloranyl)-N-[(3S)-1-(3,3-dimethylbutyl)piperidin-3-yl]benzamide 2,4-dichloro-N-[(3S)-1-(3,3-dimethylbutyl)-3-piperidyl]benzamide VU0414830-1 | cid_45115606
Type:
Small organic molecule
Emp. Form.:
C18H26Cl2N2O
Mol. Mass.:
357.318
SMILES:
CC(C)(C)CCN1CCC[C@@H](C1)NC(=O)c1ccc(Cl)cc1Cl
: