Target
Voltage-dependent T-type calcium channel subunit alpha-1H
Ligand
BDBM78514
Substrate
Meas. Tech.
Inhibitors of T-Type Calcium Channels (SynthLib2)
EC50
4000±n/a nM
Citation
 PubChem, PC Inhibitors of T-Type Calcium Channels (SynthLib2) PubChem Bioassay (2011)[AID] 
Target
Name:
Voltage-dependent T-type calcium channel subunit alpha-1H
Synonyms:
CAC1H_HUMAN Low-voltage-activated calcium channel alpha1 3.2 subunit Voltage-gated calcium channel voltage-dependent T-type calcium channel subunit alpha-1H isoform a
Type:
Enzyme Catalytic Domain
Mol. Mass.:
259187.68
Organism:
Homo sapiens (Human)
Description:
Calcium channel (Type T,L) 0 0::O95180
Residue:
2353
  
Inhibitor
Name:
BDBM78514
Synonyms:
3,5-bis(chloranyl)-N-[2-(phenylmethyl)-3,3a,4,5,6,6a-hexahydro-1H-cyclopenta[c]pyrrol-4-yl]benzamide N-(2-benzyl-3,3a,4,5,6,6a-hexahydro-1H-cyclopenta[c]pyrrol-4-yl)-3,5-dichloro-benzamide VU0413806-1 | cid_45115619
Type:
Small organic molecule
Emp. Form.:
C21H22Cl2N2O
Mol. Mass.:
389.318
SMILES:
Clc1cc(Cl)cc(c1)C(=O)NC1CCC2CN(Cc3ccccc3)CC12
: