Target
Ubiquitin-conjugating enzyme E2 N
Ligand
BDBM43864
Substrate
Meas. Tech.
Dose Response confirmation of uHTS for the identification of UBC13 Polyubiquitin Inhibitors via a TR-FRET Assay
IC50
3325±112 nM
Citation
 PubChem, PC Dose Response confirmation of uHTS for the identification of UBC13 Polyubiquitin Inhibitors via a TR-FRET Assay PubChem Bioassay (2011)[AID] 
Target
Name:
Ubiquitin-conjugating enzyme E2 N
Synonyms:
BLU UBE2N_HUMAN | ubiquitin-conjugating enzyme E2 N
Type:
PROTEIN
Mol. Mass.:
17137.61
Organism:
Homo sapiens (Human)
Description:
EBI_101440
Residue:
152
  
Inhibitor
Name:
BDBM43864
Synonyms:
2-chloranyl-N1,N4-bis[4-(4,5-dihydro-1H-imidazol-2-yl)phenyl]benzene-1,4-dicarboxamide 2-chloro-N,N''''-bis[4-(2-imidazolin-2-yl)phenyl]terephthalamide 2-chloro-N,N'-bis[4-(2-imidazolin-2-yl)phenyl]terephthalamide Glycopeptide, 3b MLS000737368 cid_65558
Type:
Peptide
Emp. Form.:
C26H23ClN6O2
Mol. Mass.:
486.953
SMILES:
Clc1cc(ccc1C(=O)Nc1ccc(cc1)C1=NCCN1)C(=O)Nc1ccc(cc1)C1=NCCN1
: