Target
Ubiquitin-conjugating enzyme E2 N
Ligand
BDBM75441
Substrate
Meas. Tech.
Dose Response confirmation of uHTS for the identification of UBC13 Polyubiquitin Inhibitors via a TR-FRET Assay
IC50
>20000±0 nM
Citation
 PubChem, PC Dose Response confirmation of uHTS for the identification of UBC13 Polyubiquitin Inhibitors via a TR-FRET Assay PubChem Bioassay (2011)[AID] 
Target
Name:
Ubiquitin-conjugating enzyme E2 N
Synonyms:
BLU UBE2N_HUMAN | ubiquitin-conjugating enzyme E2 N
Type:
PROTEIN
Mol. Mass.:
17137.61
Organism:
Homo sapiens (Human)
Description:
EBI_101440
Residue:
152
  
Inhibitor
Name:
BDBM75441
Synonyms:
1-[2-[4-[2-(3-methoxyphenyl)-1-benzothiophen-3-yl]phenoxy]ethyl]pyrrolidine 22GK (17c) SMR001397795 | cid_44202271
Type:
Small organic molecule
Emp. Form.:
C27H27NO2S
Mol. Mass.:
429.574
SMILES:
COc1cccc(c1)-c1sc2ccccc2c1-c1ccc(OCCN2CCCC2)cc1
: