Target
X-box-binding protein 1
Ligand
BDBM38964
Substrate
Meas. Tech.
XBP1 DR counterscreen for CHOP
IC50
160±n/a nM
Citation
 PubChem, PC XBP1 DR counterscreen for CHOP PubChem Bioassay (2011)[AID] 
Target
Name:
X-box-binding protein 1
Synonyms:
TREB5 XBP1_HUMAN | XBP2
Type:
Enzyme Catalytic Domain
Mol. Mass.:
28704.14
Organism:
Homo sapiens (Human)
Description:
gi_47678753
Residue:
261
  
Inhibitor
Name:
BDBM38964
Synonyms:
3-[(4-methoxyphenoxy)methyl]benzoic acid SMR000020397 | cid_3238641
Type:
Small organic molecule
Emp. Form.:
C15H14O4
Mol. Mass.:
258.2693
SMILES:
COc1ccc(OCc2cccc(c2)C(O)=O)cc1
: