Target
X-box-binding protein 1
Ligand
BDBM43524
Substrate
Meas. Tech.
XBP1 DR counterscreen for CHOP
IC50
10000±n/a nM
Citation
 PubChem, PC XBP1 DR counterscreen for CHOP PubChem Bioassay (2011)[AID] 
Target
Name:
X-box-binding protein 1
Synonyms:
TREB5 XBP1_HUMAN | XBP2
Type:
Enzyme Catalytic Domain
Mol. Mass.:
28704.14
Organism:
Homo sapiens (Human)
Description:
gi_47678753
Residue:
261
  
Inhibitor
Name:
BDBM43524
Synonyms:
4-(4-fluorophenyl)-2-(methylsulfonyl)-6-(trifluoromethyl)pyrimidine 4-(4-fluorophenyl)-2-methylsulfonyl-6-(trifluoromethyl)pyrimidine SMR000297077 cid_2987363
Type:
Small organic molecule
Emp. Form.:
C12H8F4N2O2S
Mol. Mass.:
320.263
SMILES:
CS(=O)(=O)c1nc(cc(n1)C(F)(F)F)-c1ccc(F)cc1
: