Target
X-box-binding protein 1
Ligand
BDBM43465
Substrate
Meas. Tech.
XBP1 DR counterscreen for CHOP
IC50
3150±n/a nM
Citation
 PubChem, PC XBP1 DR counterscreen for CHOP PubChem Bioassay (2011)[AID] 
Target
Name:
X-box-binding protein 1
Synonyms:
TREB5 XBP1_HUMAN | XBP2
Type:
Enzyme Catalytic Domain
Mol. Mass.:
28704.14
Organism:
Homo sapiens (Human)
Description:
gi_47678753
Residue:
261
  
Inhibitor
Name:
BDBM43465
Synonyms:
(Z)-2,3-bis(chloranyl)-3-[(4-chlorophenyl)methylsulfinyl]-N-(6-methoxypyridin-3-yl)prop-2-enamide (Z)-2,3-dichloro-3-[(4-chlorophenyl)methylsulfinyl]-N-(6-methoxy-3-pyridinyl)-2-propenamide 2,3-dichloro-3-[(4-chlorobenzyl)sulfinyl]-N-(6-methoxy-3-pyridinyl)acrylamide SMR000334340 | cid_1472220
Type:
Small organic molecule
Emp. Form.:
C16H13Cl3N2O3S
Mol. Mass.:
419.71
SMILES:
COc1ccc(NC(=O)C(Cl)=C(Cl)S(=O)Cc2ccc(Cl)cc2)cn1
: