Target
Perilipin-1
Ligand
BDBM24778
Substrate
Meas. Tech.
Luminescence-based biochemical high throughput dose response assay for inhibitors of the interaction of the lipase co-activator protein, abhydrolase domain
IC50
7895±n/a nM
Citation
 PubChem, PC Luminescence-based biochemical high throughput dose response assay for inhibitors of the interaction of the lipase co-activator protein, abhydrolase domain containing 5 (ABHD5) with perilipin-1 (PLIN1) (2K validation set) PubChem Bioassay (2011)[AID] 
Target
Name:
Perilipin-1
Synonyms:
PERI PLIN1 | PLIN1_HUMAN
Type:
Enzyme Catalytic Domain
Mol. Mass.:
55988.69
Organism:
Homo sapiens (Human)
Description:
gi_223718203
Residue:
522
  
Inhibitor
Name:
BDBM24778
Synonyms:
2-methyl-1,4-dihydronaphthalene-1,4-dione CHEMBL590 Menadione (5d) Menadione, 9 cid_4055
Type:
Small organic molecule
Emp. Form.:
C11H8O2
Mol. Mass.:
172.18
SMILES:
CC1=CC(=O)c2ccccc2C1=O
: