Target
Perilipin-1
Ligand
BDBM34863
Substrate
Meas. Tech.
Luminescence-based biochemical high throughput dose response assay for inhibitors of the interaction of the lipase co-activator protein, abhydrolase domain
IC50
3291±n/a nM
Citation
 PubChem, PC Luminescence-based biochemical high throughput dose response assay for inhibitors of the interaction of the lipase co-activator protein, abhydrolase domain containing 5 (ABHD5) with perilipin-1 (PLIN1) (2K validation set) PubChem Bioassay (2011)[AID] 
Target
Name:
Perilipin-1
Synonyms:
PERI PLIN1 | PLIN1_HUMAN
Type:
Enzyme Catalytic Domain
Mol. Mass.:
55988.69
Organism:
Homo sapiens (Human)
Description:
gi_223718203
Residue:
522
  
Inhibitor
Name:
BDBM34863
Synonyms:
(5E)-5-(4,5-dimethoxy-2-nitro-benzylidene)-1-phenyl-barbituric acid (5E)-5-[(4,5-dimethoxy-2-nitrophenyl)methylidene]-1-phenyl-1,3-diazinane-2,4,6-trione MLS000684314 cid_1363391
Type:
Small organic molecule
Emp. Form.:
C19H15N3O7
Mol. Mass.:
397.3383
SMILES:
COc1cc(C=C2C(=O)NC(=O)N(C2=O)c2ccccc2)c(cc1OC)[N+]([O-])=O
: