Target
Perilipin-1
Ligand
BDBM79421
Substrate
Meas. Tech.
Luminescence-based biochemical high throughput dose response assay for inhibitors of the interaction of the lipase co-activator protein, abhydrolase domain
IC50
19048±n/a nM
Citation
 PubChem, PC Luminescence-based biochemical high throughput dose response assay for inhibitors of the interaction of the lipase co-activator protein, abhydrolase domain containing 5 (ABHD5) with perilipin-1 (PLIN1) (2K validation set) PubChem Bioassay (2011)[AID] 
Target
Name:
Perilipin-1
Synonyms:
PERI PLIN1 | PLIN1_HUMAN
Type:
Enzyme Catalytic Domain
Mol. Mass.:
55988.69
Organism:
Homo sapiens (Human)
Description:
gi_223718203
Residue:
522
  
Inhibitor
Name:
BDBM79421
Synonyms:
MLS000688360 cid_2927361
Type:
Small organic molecule
Emp. Form.:
C20H19NO2
Mol. Mass.:
305.3704
SMILES:
CC1(C)CC(C)(c2ccccc2)c2cccc3C(=O)C(=O)N1c23
: