Target
Perilipin-5
Ligand
BDBM79407
Substrate
Meas. Tech.
Luminescence-based biochemical high throughput dose response assay for inhibitors of the interaction of the lipase co-activator protein, abhydrolase domain
IC50
4641±n/a nM
Citation
 PubChem, PC Luminescence-based biochemical high throughput dose response assay for inhibitors of the interaction of the lipase co-activator protein, abhydrolase domain containing 5 (ABHD5) with perilipin-5 (MLDP; PLIN5) (2K validation set) PubChem Bioassay (2011)[AID] 
Target
Name:
Perilipin-5
Synonyms:
LSDP5 PAT-1 PLIN5_HUMAN
Type:
Enzyme Catalytic Domain
Mol. Mass.:
50774.20
Organism:
Homo sapiens (Human)
Description:
gi_116292172
Residue:
463
  
Inhibitor
Name:
BDBM79407
Synonyms:
(2R)-2-amino-3-mercapto-propionic acid methyl ester;hydrochloride L-CYSTEINE METHYL ESTER HYDROCHLORIDE SMR000058406 methyl (2R)-2-amino-3-sulfanylpropanoate;hydrochloride | methyl (2R)-2-azanyl-3-sulfanyl-propanoate;hydrochloride
Type:
Small organic molecule
Emp. Form.:
C4H9NO2S
Mol. Mass.:
135.185
SMILES:
COC(=O)[C@@H](N)CS
: