Target
DNA damage-inducible transcript 3 protein
Ligand
BDBM32337
Substrate
Meas. Tech.
CHOP dose-response primary assay
IC50
600±n/a nM
Citation
 PubChem, PC CHOP dose-response primary assay PubChem Bioassay (2011)[AID] 
Target
Name:
DNA damage-inducible transcript 3 protein
Synonyms:
Chop DDIT3_MOUSE Gadd153
Type:
Enzyme Catalytic Domain
Mol. Mass.:
19175.17
Organism:
Mus musculus
Description:
gi_160707929
Residue:
168
  
Inhibitor
Name:
BDBM32337
Synonyms:
MLS000028832 STAUROSPORINE | cid_5311103
Type:
Small organic molecule
Emp. Form.:
C28H26N4O3
Mol. Mass.:
466.531
SMILES:
[H][C@]12C[C@H](NC)[C@H](OC)[C@](C)(O1)n1c3ccccc3c3c4CNC(=O)c4c4c5ccccc5n2c4c13
: