Target
DNA damage-inducible transcript 3 protein
Ligand
BDBM50213
Substrate
Meas. Tech.
CHOP dose-response primary assay
IC50
170±n/a nM
Citation
 PubChem, PC CHOP dose-response primary assay PubChem Bioassay (2011)[AID] 
Target
Name:
DNA damage-inducible transcript 3 protein
Synonyms:
Chop DDIT3_MOUSE Gadd153
Type:
Enzyme Catalytic Domain
Mol. Mass.:
19175.17
Organism:
Mus musculus
Description:
gi_160707929
Residue:
168
  
Inhibitor
Name:
BDBM50213
Synonyms:
3-Hydroxy-naphthalene-2-carboxylic acid (1-benzyl-2-oxo-1,2-dihydro-indol-3-ylidene)-hydrazide 3-oxidanyl-N-[(Z)-[2-oxidanylidene-1-(phenylmethyl)indol-3-ylidene]amino]naphthalene-2-carboxamide N-[(Z)-(1-benzyl-2-keto-indolin-3-ylidene)amino]-3-hydroxy-2-naphthamide SMR000171355 | cid_9591396
Type:
Small organic molecule
Emp. Form.:
C26H19N3O3
Mol. Mass.:
421.4474
SMILES:
Oc1cc2ccccc2cc1C(=O)N\N=C1/C(=O)N(Cc2ccccc2)c2ccccc12
: