Target
DNA damage-inducible transcript 3 protein
Ligand
BDBM57635
Substrate
Meas. Tech.
CHOP dose-response primary assay
IC50
580±n/a nM
Citation
 PubChem, PC CHOP dose-response primary assay PubChem Bioassay (2011)[AID] 
Target
Name:
DNA damage-inducible transcript 3 protein
Synonyms:
Chop DDIT3_MOUSE Gadd153
Type:
Enzyme Catalytic Domain
Mol. Mass.:
19175.17
Organism:
Mus musculus
Description:
gi_160707929
Residue:
168
  
Inhibitor
Name:
BDBM57635
Synonyms:
MLS000722278 N-[2-(1H-benzimidazol-2-yl)phenyl]-3-chloro-1-benzothiophene-2-carboxamide SMR000235965 | cid_4246134
Type:
Small organic molecule
Emp. Form.:
C22H14ClN3OS
Mol. Mass.:
403.884
SMILES:
Clc1c(sc2ccccc12)C(=O)Nc1ccccc1-c1nc2ccccc2[nH]1
: