Target
DNA damage-inducible transcript 3 protein
Ligand
BDBM54739
Substrate
Meas. Tech.
CHOP dose-response primary assay
IC50
310±n/a nM
Citation
 PubChem, PC CHOP dose-response primary assay PubChem Bioassay (2011)[AID] 
Target
Name:
DNA damage-inducible transcript 3 protein
Synonyms:
Chop DDIT3_MOUSE Gadd153
Type:
Enzyme Catalytic Domain
Mol. Mass.:
19175.17
Organism:
Mus musculus
Description:
gi_160707929
Residue:
168
  
Inhibitor
Name:
BDBM54739
Synonyms:
3-[1-(4-fluorophenyl)tetrazol-5-yl]sulfanyl-1-(4-methoxyphenyl)pyrrolidine-2,5-dione 3-[[1-(4-fluorophenyl)-5-tetrazolyl]thio]-1-(4-methoxyphenyl)pyrrolidine-2,5-dione 3-{[1-(4-fluorophenyl)-1H-tetrazol-5-yl]thio}-1-(4-methoxyphenyl)-2,5-pyrrolidinedione SMR000293005 | cid_2945197
Type:
Small organic molecule
Emp. Form.:
C18H14FN5O3S
Mol. Mass.:
399.399
SMILES:
COc1ccc(cc1)-n1c(O)cc(Sc2nnnn2-c2ccc(F)cc2)c1O
: