Target
DNA damage-inducible transcript 3 protein
Ligand
BDBM68166
Substrate
Meas. Tech.
CHOP dose-response primary assay
IC50
>10000±n/a nM
Citation
 PubChem, PC CHOP dose-response primary assay PubChem Bioassay (2011)[AID] 
Target
Name:
DNA damage-inducible transcript 3 protein
Synonyms:
Chop DDIT3_MOUSE Gadd153
Type:
Enzyme Catalytic Domain
Mol. Mass.:
19175.17
Organism:
Mus musculus
Description:
gi_160707929
Residue:
168
  
Inhibitor
Name:
BDBM68166
Synonyms:
2-(4-hydroxyphenyl)-6,8-bis(3-methylbut-2-enyl)-5,7-bis(oxidanyl)-2,3-dihydrochromen-4-one 5,7-dihydroxy-2-(4-hydroxyphenyl)-6,8-bis(3-methylbut-2-enyl)-3,4-dihydro-2H-1-benzopyran-4-one MLS000876964 cid_3951
Type:
Small organic molecule
Emp. Form.:
C25H28O5
Mol. Mass.:
408.4868
SMILES:
[#6]\[#6](-[#6])=[#6]\[#6]-c1c(-[#8])c(-[#6]\[#6]=[#6](\[#6])-[#6])c2-[#8]-[#6](-[#6]-[#6](=O)-c2c1-[#8])-c1ccc(-[#8])cc1
: