Target
Caspase-7
Ligand
BDBM79432
Substrate
Meas. Tech.
Dose response assay for dual activators of procaspase-3 and procaspase-7: Absorbance-based biochemical high throughput screening assay to identify activators of procaspase-7
EC50
>85252±n/a nM
Citation
 PubChem, PC Dose response assay for dual activators of procaspase-3 and procaspase-7: Absorbance-based biochemical high throughput screening assay to identify activators of procaspase-7 PubChem Bioassay (2011)[AID] 
Target
Name:
Caspase-7
Synonyms:
Apoptotic protease Mch-3 CASP7 CMH-1 MCH3 | caspase 7, apoptosis-related cysteine peptidase
Type:
Enzyme
Mol. Mass.:
34273.91
Organism:
Homo sapiens (Human)
Description:
P55210
Residue:
303
  
Inhibitor
Name:
BDBM79432
Synonyms:
1-[2,3-bis(chloranyl)phenyl]-3-chloranyl-4-(prop-2-enylamino)pyrrole-2,5-dione 3-(allylamino)-4-chloro-1-(2,3-dichlorophenyl)-3-pyrroline-2,5-quinone MLS000533809 cid_1560351
Type:
Small organic molecule
Emp. Form.:
C13H9Cl3N2O2
Mol. Mass.:
331.582
SMILES:
Oc1c(Cl)c(N=CC=C)c(O)n1-c1cccc(Cl)c1Cl
: