Target
Caspase-7
Ligand
BDBM79433
Substrate
Meas. Tech.
Dose response assay for dual activators of procaspase-3 and procaspase-7: Absorbance-based biochemical high throughput screening assay to identify activators of procaspase-7
EC50
>85284±n/a nM
Citation
 PubChem, PC Dose response assay for dual activators of procaspase-3 and procaspase-7: Absorbance-based biochemical high throughput screening assay to identify activators of procaspase-7 PubChem Bioassay (2011)[AID] 
Target
Name:
Caspase-7
Synonyms:
Apoptotic protease Mch-3 CASP7 CMH-1 MCH3 | caspase 7, apoptosis-related cysteine peptidase
Type:
Enzyme
Mol. Mass.:
34273.91
Organism:
Homo sapiens (Human)
Description:
P55210
Residue:
303
  
Inhibitor
Name:
BDBM79433
Synonyms:
MLS000556848 cid_4678256
Type:
Small organic molecule
Emp. Form.:
C30H31N3O3
Mol. Mass.:
481.5854
SMILES:
[H]C12C=CC([H])(C3CC13)C1C2C(=O)N(C2CCC(CC2)C(=O)Nc2ccc(Cc3ccncc3)cc2)C1=O
: