Target
Muscarinic acetylcholine receptor M2
Ligand
BDBM42323
Substrate
Meas. Tech.
Late-stage radioligand binding dose response assay to identify inhibitors of NADPH oxidase 1 (NOX1): PDSP screen Ki Set 2
Ki
>10000±n/a nM
Citation
 PubChem, PC Late-stage radioligand binding dose response assay to identify inhibitors of NADPH oxidase 1 (NOX1): PDSP screen Ki Set 2 PubChem Bioassay (2011)[AID] 
Target
Name:
Muscarinic acetylcholine receptor M2
Synonyms:
ACM2_HUMAN Cholinergic, muscarinic M2 Muscarinic acetylcholine receptor M2 and M5 | RecName: Full=Muscarinic acetylcholine receptor M2
Type:
GPCR
Mol. Mass.:
51730.61
Organism:
Homo sapiens (Human)
Description:
P08172
Residue:
466
  
Inhibitor
Name:
BDBM42323
Synonyms:
1-(10H-phenothiazin-2-yl)ethanone SMR000033635 | cid_81131
Type:
Small organic molecule
Emp. Form.:
C14H11NOS
Mol. Mass.:
241.308
SMILES:
CC(=O)c1ccc2Sc3ccccc3Nc2c1
: