Target
Peroxisome proliferator-activated receptor gamma
Ligand
BDBM79443
Substrate
Meas. Tech.
TR-FRET-based biochemical dose response competitive binding lanthascreen assay for partial agonists of the peroxisome proliferator-activated receptor gamma (PPARg)
IC50
1200±n/a nM
Citation
 PubChem, PC TR-FRET-based biochemical dose response competitive binding lanthascreen assay for partial agonists of the peroxisome proliferator-activated receptor gamma (PPARg) PubChem Bioassay (2011)[AID] 
Target
Name:
Peroxisome proliferator-activated receptor gamma
Synonyms:
NR1C3 PPAR-gamma PPARG_HUMAN Peroxisome proliferator-activated receptor gamma (PPAR gamma) Peroxisome proliferator-activated receptor gamma (PPARĪ³) peroxisome proliferator-activated receptor gamma isoform 2
Type:
Nuclear Receptor
Mol. Mass.:
57613.46
Organism:
Homo sapiens (Human)
Description:
P37231
Residue:
505
  
Inhibitor
Name:
BDBM79443
Synonyms:
3-(furan-2-carbonyl)-4-hydroxy-1-(6-methoxy-1,3-benzothiazol-2-yl)-2-(5-methylfuran-2-yl)-2H-pyrrol-5-one 3-[2-furanyl(oxo)methyl]-4-hydroxy-1-(6-methoxy-1,3-benzothiazol-2-yl)-2-(5-methyl-2-furanyl)-2H-pyrrol-5-one MLS001291208 SR-01000325756 cid_3152766
Type:
Small organic molecule
Emp. Form.:
C22H16N2O6S
Mol. Mass.:
436.437
SMILES:
COc1ccc2nc(sc2c1)N1C(C(C(=O)c2ccco2)C(=O)C1=O)c1ccc(C)o1
: