Target
Peroxisome proliferator-activated receptor gamma
Ligand
BDBM64759
Substrate
Meas. Tech.
Luminescence-based cell-based assay provider high throughput dose response assay for partial agonists of the peroxisome proliferator-activated receptor gamma (PPARg)
EC50
26000±n/a nM
Citation
 PubChem, PC Luminescence-based cell-based assay provider high throughput dose response assay for partial agonists of the peroxisome proliferator-activated receptor gamma (PPARg) PubChem Bioassay (2011)[AID] 
Target
Name:
Peroxisome proliferator-activated receptor gamma
Synonyms:
NR1C3 PPAR-gamma PPARG_HUMAN Peroxisome proliferator-activated receptor gamma (PPAR gamma) Peroxisome proliferator-activated receptor gamma (PPARĪ³) peroxisome proliferator-activated receptor gamma isoform 2
Type:
Nuclear Receptor
Mol. Mass.:
57613.46
Organism:
Homo sapiens (Human)
Description:
P37231
Residue:
505
  
Inhibitor
Name:
BDBM64759
Synonyms:
3-(furan-2-carbonyl)-4-hydroxy-1-(6-methyl-1,3-benzothiazol-2-yl)-2-(5-methylfuran-2-yl)-2H-pyrrol-5-one;oxalic acid 4-(2-furoyl)-3-hydroxy-1-(6-methyl-1,3-benzothiazol-2-yl)-5-(5-methyl-2-furyl)-3-pyrrolin-2-one;oxalic acid MLS001221390 cid_24792442 | ethanedioic acid;3-(furan-2-ylcarbonyl)-1-(6-methyl-1,3-benzothiazol-2-yl)-2-(5-methylfuran-2-yl)-4-oxidanyl-2H-pyrrol-5-one
Type:
Small organic molecule
Emp. Form.:
C22H16N2O5S
Mol. Mass.:
420.438
SMILES:
Cc1ccc(o1)C1C(C(=O)c2ccco2)C(=O)C(=O)N1c1nc2ccc(C)cc2s1
: