Target
Peroxisome proliferator-activated receptor gamma
Ligand
BDBM79453
Substrate
Meas. Tech.
Luminescence-based cell-based assay provider high throughput dose response assay for partial agonists of the peroxisome proliferator-activated receptor gamma (PPARg)
EC50
2400±n/a nM
Citation
 PubChem, PC Luminescence-based cell-based assay provider high throughput dose response assay for partial agonists of the peroxisome proliferator-activated receptor gamma (PPARg) PubChem Bioassay (2011)[AID] 
Target
Name:
Peroxisome proliferator-activated receptor gamma
Synonyms:
NR1C3 PPAR-gamma PPARG_HUMAN Peroxisome proliferator-activated receptor gamma (PPAR gamma) Peroxisome proliferator-activated receptor gamma (PPARĪ³) peroxisome proliferator-activated receptor gamma isoform 2
Type:
Nuclear Receptor
Mol. Mass.:
57613.46
Organism:
Homo sapiens (Human)
Description:
P37231
Residue:
505
  
Inhibitor
Name:
BDBM79453
Synonyms:
5-(5-chloranyl-2-oxidanyl-phenyl)carbonyl-1-(2-methoxyphenyl)-2-oxidanylidene-pyridine-3-carbonitrile 5-(5-chloro-2-hydroxybenzoyl)-1-(2-methoxyphenyl)-2-oxopyridine-3-carbonitrile SR-01000737791 cid_2367263
Type:
Small organic molecule
Emp. Form.:
C20H13ClN2O4
Mol. Mass.:
380.781
SMILES:
COc1ccccc1-n1cc(cc(C#N)c1=O)C(=O)c1cc(Cl)ccc1O
: