Target
Sphingosine 1-phosphate receptor 4
Ligand
BDBM75589
Substrate
Meas. Tech.
Late-stage fluorescence dose response cell-based assay to identify agonists of the Sphingosine 1-Phosphate Receptor 4 (S1P4): purchased compounds EC50
EC50
20700±n/a nM
Citation
 PubChem, PC Late-stage fluorescence dose response cell-based assay to identify agonists of the Sphingosine 1-Phosphate Receptor 4 (S1P4): purchased compounds EC50 PubChem Bioassay (2011)[AID] 
Target
Name:
Sphingosine 1-phosphate receptor 4
Synonyms:
EDG6 S1P receptor 4 S1P4 S1PR4_HUMAN Sphingosine 1-phosphate receptor Edg-6 sphingosine-1-phosphate 4 S1P4
Type:
G Protein-Coupled Receptor (GPCR)
Mol. Mass.:
41647.39
Organism:
Homo sapiens (Human)
Description:
Residue:
384
  
Inhibitor
Name:
BDBM75589
Synonyms:
3-[2-(4-bromanylphenoxy)ethoxy]-6-methyl-2-nitro-pyridine 3-[2-(4-bromophenoxy)ethoxy]-6-methyl-2-nitropyridine SR-01000055180 cid_3879894
Type:
Small organic molecule
Emp. Form.:
C14H13BrN2O4
Mol. Mass.:
353.168
SMILES:
Cc1ccc(OCCOc2ccc(Br)cc2)c(n1)[N+]([O-])=O
: