Target
Beta-adrenergic receptor kinase 1
Ligand
BDBM31759
Substrate
Meas. Tech.
Dose Response of inhibitors of GRK2 binding with RNA aptamer, Cherry Pick 1
EC50
2390±n/a nM
Citation
 PubChem, PC Dose Response of inhibitors of GRK2 binding with RNA aptamer, Cherry Pick 1 PubChem Bioassay (2011)[AID] 
Target
Name:
Beta-adrenergic receptor kinase 1
Synonyms:
ADRBK1 BARK Beta-ARK-1 G-protein coupled receptor kinase 2 GRK2
Type:
Enzyme
Mol. Mass.:
79581.30
Organism:
Homo sapiens (Human)
Description:
P25098
Residue:
689
  
Inhibitor
Name:
BDBM31759
Synonyms:
2-[5-[(Z)-(3-bromanyl-8-oxidanylidene-[1,3]thiazolo[4,5]imidazo[1,2-b]pyridin-7-ylidene)methyl]furan-2-yl]benzoic acid 2-[5-[(Z)-(3-bromo-8-oxo-7-thiazolo[4,5]imidazo[1,2-b]pyridinylidene)methyl]-2-furanyl]benzoic acid MLS-0090801.0001 | cid_1357397
Type:
Small organic molecule
Emp. Form.:
C20H10BrN3O4S
Mol. Mass.:
468.28
SMILES:
OC(=O)c1ccccc1-c1ccc(\C=c2/sc3nc4cc(Br)cnc4n3c2=O)o1
: