Target
Beta-adrenergic receptor kinase 1
Ligand
BDBM79497
Substrate
Meas. Tech.
Dose Response of inhibitors of GRK2 binding with RNA aptamer, Cherry Pick 1
EC50
30900±n/a nM
Citation
 PubChem, PC Dose Response of inhibitors of GRK2 binding with RNA aptamer, Cherry Pick 1 PubChem Bioassay (2011)[AID] 
Target
Name:
Beta-adrenergic receptor kinase 1
Synonyms:
ADRBK1 BARK Beta-ARK-1 G-protein coupled receptor kinase 2 GRK2
Type:
Enzyme
Mol. Mass.:
79581.30
Organism:
Homo sapiens (Human)
Description:
P25098
Residue:
689
  
Inhibitor
Name:
BDBM79497
Synonyms:
1-(2,3-dihydro-1,4-benzodioxin-6-yl)-5-keto-pyrrolidine-3-carboxylic acid 1-(2,3-dihydro-1,4-benzodioxin-6-yl)-5-oxo-3-pyrrolidinecarboxylic acid MLS000570216 cid_2741832
Type:
Small organic molecule
Emp. Form.:
C13H13NO5
Mol. Mass.:
263.246
SMILES:
OC(=O)C1CN(C(=O)C1)c1ccc2OCCOc2c1
: