Target
Mitochondrial import inner membrane translocase subunit TIM23
Ligand
BDBM55408
Substrate
Meas. Tech.
Dose Response confirmation of uHTS small molecule inhibitors of tim10-1: a luminescent tim23-1 yeast counterscreen.
IC50
5810±n/a nM
Citation
 PubChem, PC Dose Response confirmation of uHTS small molecule inhibitors of tim10-1: a luminescent tim23-1 yeast counterscreen. PubChem Bioassay (2011)[AID] 
Target
Name:
Mitochondrial import inner membrane translocase subunit TIM23
Synonyms:
MAS6 MPI3 TIM23_YEAST | TPA: Essential component of the Translocase of the Inner Mitochondrial membrane (TIM23 complex)
Type:
Enzyme Catalytic Domain
Mol. Mass.:
23245.32
Organism:
Saccharomyces cerevisiae S288c
Description:
gi_285814664
Residue:
222
  
Inhibitor
Name:
BDBM55408
Synonyms:
2-[(E)-2-(5-nitrofuran-2-yl)ethenyl]-3-(3-oxidanylpropyl)quinazolin-4-one 3-(3-hydroxypropyl)-2-[(E)-2-(5-nitro-2-furyl)vinyl]quinazolin-4-one 3-(3-hydroxypropyl)-2-[2-(5-nitro-2-furyl)vinyl]-4(3H)-quinazolinone SMR000142456 | cid_5736472
Type:
Small organic molecule
Emp. Form.:
C17H15N3O5
Mol. Mass.:
341.3181
SMILES:
OCCCn1c(\C=C\c2ccc(o2)[N+]([O-])=O)nc2ccccc2c1=O
: